设为首页收藏本站

搜客社区-搜客网

 找回密码
 立即注册

QQ登录

只需一步,快速开始

查看: 637|回复: 6

[C/C++] 我的朋友给我的手游编译出现这问题是怎么回事 在他电脑就可以

[复制链接]
发表于 2017-1-9 08:26:22 | 显示全部楼层 |阅读模式
At global scope:
cc1plus.exe: warning: unrecognized command line option "-Wno-extern-c-compat"
[armeabi] Compile++ thumb: cocos2dxandroid_static <= JniHelper.cpp
[armeabi] Compile++ thumb: cocos2dxandroid_static <= TouchesJni.cpp
[armeabi] Compile++ thumb: cocos2dxandroid_static <= CocosPlayClient.cpp
[armeabi] Compile thumb  : cpufeatures <= cpu-features.c
[armeabi] StaticLibrary  : libcocos3d.a
[armeabi] StaticLibrary  : libui.a
[armeabi] StaticLibrary  : flatbuffers.a
[armeabi] StaticLibrary  : libbox2d.a
[armeabi] StaticLibrary  : libcocos2dxinternal.a
[armeabi] StaticLibrary  : librecast.a
[armeabi] StaticLibrary  : libbullet.a
[armeabi] StaticLibrary  : libcocostudio.a
[armeabi] StaticLibrary  : libcocosbuilder.a
[armeabi] StaticLibrary  : libspine.a
[armeabi] StaticLibrary  : libcocosdenshion.a
[armeabi] StaticLibrary  : libextension.a
[armeabi] StaticLibrary  : libaudioengine.a
[armeabi] StaticLibrary  : libnetwork.a
[armeabi] StaticLibrary  : libcocos2dandroid.a
[armeabi] StaticLibrary  : libcpufeatures.a
[armeabi] SharedLibrary  : libcocos2dcpp.so
H:/Phone-foxuc/app/proj.android/../cocos2d/external/websockets/prebuilt/android/
armeabi/libwebsockets.a(context.c.o):context.c:function libwebsocket_create_cont
ext: error: undefined reference to 'getdtablesize'
collect2.exe: error: ld returned 1 exit status
make: *** [obj/local/armeabi/libcocos2dcpp.so] Error 1
make: Leaving directory `H:/Phone-foxuc/app/proj.android'
执行命令出错,返回值:2。
Traceback (most recent call last):
  File "H:\Phone-foxuc\app\proj.android\build_native.py", line 43, in <module>
    build(opts.build_mode)
  File "H:\Phone-foxuc\app\proj.android\build_native.py", line 28, in build
    raise Exception("Build dynamic library for project [ " + app_android_root +
" ] fails!")
Exception: Build dynamic library for project [ H:\Phone-foxuc\app\proj.android\.
./ ] fails!


回复

使用道具 举报

发表于 2017-1-11 12:35:08 | 显示全部楼层
环境配置错误,检查一下你的路径和库的配置
回复 支持 反对

使用道具 举报

发表于 2017-1-9 14:44:08 | 显示全部楼层
这是什么游戏,是什么东西
回复 支持 反对

使用道具 举报

发表于 2017-1-9 15:42:25 | 显示全部楼层
undefined reference to 'getdtablesize'! 没有这个 "getdtablesize" 函数,可能是少了啥,也可能是写错了名字
回复 支持 反对

使用道具 举报

发表于 2017-1-10 20:26:34 | 显示全部楼层
环境配置错误,检查一下你的路径和库的配置把
回复 支持 反对

使用道具 举报

发表于 2017-1-12 10:04:37 | 显示全部楼层
检查一下你的路径和库的配置
回复 支持 反对

使用道具 举报

 楼主| 发表于 2017-1-12 11:19:03 | 显示全部楼层
检查一下你的路径
库的配置   

上面2个是不是让我检查开发环境的路径和库的配置呢?
回复 支持 反对

使用道具 举报

您需要登录后才可以回帖 登录 | 立即注册

本版积分规则

文字版|小黑屋|搜客社区    

GMT+8, 2017-8-23 02:41 , Processed in 0.076792 second(s), 24 queries .

Powered by Discuz! X3.2

© 2001-2013 Comsenz Inc.

快速回复 返回顶部 返回列表